Target
ATP-dependent translocase ABCB1
Ligand
BDBM50370258
Substrate
Meas. Tech.
ChEMBL_838281 (CHEMBL2076229)
Ki
87640±n/a nM
Citation
 Ekins, SKim, RBLeake, BFDantzig, AHSchuetz, EGLan, LBYasuda, KShepard, RLWinter, MASchuetz, JDWikel, JHWrighton, SA Three-dimensional quantitative structure-activity relationships of inhibitors of P-glycoprotein. Mol Pharmacol 61:964-73 (2002)  
Target
Name:
ATP-dependent translocase ABCB1
Synonyms:
ABCB1 MDR1_HUMAN Multidrug resistance protein 1 P-glycoprotein (P-gp) PGY1
Type:
Protein
Mol. Mass.:
141503.50
Organism:
Homo sapiens (Human)
Description:
P08183
Residue:
1280
  
Inhibitor
Name:
BDBM50370258
Synonyms:
TROLEANDOMYCIN | Triacetyloleandomycin
Type:
Small organic molecule
Emp. Form.:
C41H67NO15
Mol. Mass.:
813.9684
SMILES:
CO[C@H]1C[C@H](O[C@H]2[C@H](C)[C@@H](O[C@@H]3O[C@H](C)C[C@@H]([C@H]3OC(C)=O)N(C)C)[C@@H](C)C[C@@]3(CO3)C(=O)[C@H](C)[C@@H](OC(C)=O)[C@@H](C)[C@@H](C)OC(=O)[C@@H]2C)O[C@@H](C)[C@@H]1OC(C)=O
: