Target
ATP-binding cassette sub-family C member 3
Ligand
BDBM50391002
Substrate
Meas. Tech.
ChEMBL_839340 (CHEMBL2078011)
Ki
2600±n/a nM
Citation
 Akita, HSuzuki, HHirohashi, TTakikawa, HSugiyama, Y Transport activity of human MRP3 expressed in Sf9 cells: comparative studies with rat MRP3. Pharm Res 19:34-41 (2002)  
Target
Name:
ATP-binding cassette sub-family C member 3
Synonyms:
ATP-binding cassette sub-family C member 3 Canalicular multispecific organic anion transporter 2 MLP-2 MRP3_RAT Mrp3 | Multidrug resistance-associated protein 3
Type:
PROTEIN
Mol. Mass.:
168984.11
Organism:
Rattus norvegicus
Description:
ChEMBL_839340
Residue:
1522
  
Inhibitor
Name:
BDBM50391002
Synonyms:
CHEMBL2074599
Type:
Small organic molecule
Emp. Form.:
C22H25N3O7S
Mol. Mass.:
475.515
SMILES:
CNc1nc2c(Cc3cccnc3)c(C)c(O[C@@H]3O[C@@H]([C@@H](O)[C@H](O)[C@H]3O)C(O)=O)c(C)c2s1
: