Target
Tyrosine-protein phosphatase non-receptor type 1
Ligand
BDBM50391109
Substrate
Meas. Tech.
ChEMBL_840644 (CHEMBL2090295)
IC50
46±n/a nM
Citation
 Liu, JJiang, FJin, YZhang, YLiu, JLiu, WFu, L Design, synthesis, and evaluation of 2-substituted ethenesulfonic acid ester derivatives as protein tyrosine phosphatase 1B inhibitors. Eur J Med Chem 57:10-20 (2012)  
Target
Name:
Tyrosine-protein phosphatase non-receptor type 1
Synonyms:
PTN1_HUMAN PTPN1 Protein tyrosine phosphatase-1B (PTP1B) Protein-tyrosine phosphatase 1B (PTP1B) Tyrosine-protein phosphatase non-receptor type 1 (PTP1B)
Type:
Protein phosphatase
Mol. Mass.:
49963.76
Organism:
Homo sapiens (Human)
Description:
Human recombinant GST-fusion PTP1B (1-435).
Residue:
435
  
Inhibitor
Name:
BDBM50391109
Synonyms:
CHEMBL179166 Vanadates
Type:
Small organic molecule
Emp. Form.:
O4V
Mol. Mass.:
114.9407
SMILES:
[O-][V]([O-])([O-])=O
: