Target
Sodium channel protein type 9 subunit alpha
Ligand
BDBM50391502
Substrate
Meas. Tech.
ChEMBL_849456 (CHEMBL2149457)
IC50
32±n/a nM
Citation
 Kers, IMacsari, ICsjernyik, GNylöf, MSkogholm, KSandberg, LMinidis, ABueters, TMalmborg, JEriksson, ABLund, PEVenyike, ELuo, LNyström, JEBesidski, Y Phenethyl nicotinamides, a novel class of Na(V)1.7 channel blockers: structure and activity relationship. Bioorg Med Chem Lett 22:6108-15 (2012)  
Target
Name:
Sodium channel protein type 9 subunit alpha
Synonyms:
NENA Peripheral sodium channel 1 SCN9A_HUMAN Voltage-gated sodium channel subunit Nav1.7 hNE-Na
Type:
Protein
Mol. Mass.:
226375.97
Organism:
Homo sapiens (Human)
Description:
Q15858
Residue:
1988
  
Inhibitor
Name:
BDBM50391502
Synonyms:
CHEMBL2147305
Type:
Small organic molecule
Emp. Form.:
C23H22F4N4O3
Mol. Mass.:
478.4394
SMILES:
COc1ncc(cn1)-c1c(C)ccc(F)c1CCNC(=O)c1ccc(OCCC(F)(F)F)nc1
: