Target
Potassium voltage-gated channel subfamily H member 2
Ligand
BDBM50391499
Substrate
Meas. Tech.
ChEMBL_849458 (CHEMBL2149459)
IC50
<31623±n/a nM
Citation
 Kers, IMacsari, ICsjernyik, GNylöf, MSkogholm, KSandberg, LMinidis, ABueters, TMalmborg, JEriksson, ABLund, PEVenyike, ELuo, LNyström, JEBesidski, Y Phenethyl nicotinamides, a novel class of Na(V)1.7 channel blockers: structure and activity relationship. Bioorg Med Chem Lett 22:6108-15 (2012)  
Target
Name:
Potassium voltage-gated channel subfamily H member 2
Synonyms:
1,3-beta-glucan synthase component GLS2 ERG Eag-related protein 1 Ether-a-go-go-related gene (HERG) Ether-a-go-go-related gene potassium channel 1 Ether-a-go-go-related gene potassium channel 1 (hERG1) Ether-a-go-go-related protein 1 H-ERG KCNH2 Potassium voltage-gated channel subfamily H member 2 (hERG) Voltage-gated potassium channel subunit Kv11.1 hERG Potassium Channel 1 | putative potassium channel subunit
Type:
Multi-pass membrane protein
Mol. Mass.:
126672.65
Organism:
Homo sapiens (Human)
Description:
Q12809
Residue:
1159
  
Inhibitor
Name:
BDBM50391499
Synonyms:
CHEMBL2147309
Type:
Small organic molecule
Emp. Form.:
C22H19F5N4O2
Mol. Mass.:
466.4039
SMILES:
Cc1cnc(cn1)-c1c(F)ccc(F)c1CCNC(=O)c1ccc(COCC(F)(F)F)nc1
: