Target
Sodium channel protein type 9 subunit alpha
Ligand
BDBM50391508
Substrate
Meas. Tech.
ChEMBL_849479 (CHEMBL2149480)
IC50
900±n/a nM
Citation
 Kers, IMacsari, ICsjernyik, GNylöf, MSkogholm, KSandberg, LMinidis, ABueters, TMalmborg, JEriksson, ABLund, PEVenyike, ELuo, LNyström, JEBesidski, Y Phenethyl nicotinamides, a novel class of Na(V)1.7 channel blockers: structure and activity relationship. Bioorg Med Chem Lett 22:6108-15 (2012)  
Target
Name:
Sodium channel protein type 9 subunit alpha
Synonyms:
PN1 SCN9A_RAT Sodium channel protein type 9 subunit alpha Sodium channel protein type IX subunit alpha Voltage-gated sodium channel subunit alpha Nav1.7
Type:
PROTEIN
Mol. Mass.:
226035.47
Organism:
Rattus norvegicus
Description:
ChEMBL_1516887
Residue:
1984
  
Inhibitor
Name:
BDBM50391508
Synonyms:
CHEMBL2147316
Type:
Small organic molecule
Emp. Form.:
C22H19F5N4O3
Mol. Mass.:
482.4033
SMILES:
COc1cnc(cn1)-c1ccccc1C(F)(F)CNC(=O)c1ccc(COCC(F)(F)F)nc1
: