Target
Prothrombin
Ligand
BDBM50391540
Substrate
Meas. Tech.
ChEMBL_849827 (CHEMBL2148454)
EC50
7500±n/a nM
Citation
 Anas, ARKisugi, TUmezawa, TMatsuda, FCampitelli, MRQuinn, RJOkino, T Thrombin inhibitors from the freshwater cyanobacterium Anabaena compacta. J Nat Prod 75:1546-52 (2012)  
Target
Name:
Prothrombin
Synonyms:
Activation peptide fragment 1 Coagulation factor II Prothrombin precursor Thrombin heavy chain | Thrombin light chain
Type:
Protein
Mol. Mass.:
70029.57
Organism:
Homo sapiens (Human)
Description:
P00734
Residue:
622
  
Inhibitor
Name:
BDBM50391540
Synonyms:
CHEMBL2147469
Type:
Small organic molecule
Emp. Form.:
C31H44N6O7
Mol. Mass.:
612.7171
SMILES:
[#6]-[#6@H]-1-[#6]-[#6@H](-[#7](-[#6]-1)-[#6](=O)-[#6@@H](-[#6]-[#6]-c1ccc(-[#8])cc1)-[#7]-[#6](=O)-[#6@H](-[#8])-[#6]-c1ccc(-[#8])cc1)-[#6](=O)-[#7]-[#6@H](-[#6]-[#8])-[#6]-[#6]-[#6]\[#7]=[#6](\[#7])-[#7]
: