Target
Kappa-type opioid receptor
Ligand
BDBM50391595
Substrate
Meas. Tech.
ChEMBL_850393 (CHEMBL2150813)
Ki
71.85±n/a nM
Citation
 Ida, YMatsubara, ANemoto, TSaito, MHirayama, SFujii, HNagase, H Synthesis of quinolinomorphinan derivatives as highly selectived opioid receptor ligands. Bioorg Med Chem 20:5810-31 (2012)  
Target
Name:
Kappa-type opioid receptor
Synonyms:
Kappa Opioid Receptor OPRK1 Opiate Kappa 1 | mu/kappa opioid receptor
Type:
G Protein-Coupled Receptor (GPCR)
Mol. Mass.:
42744.99
Organism:
Cavia porcellus (domestic guinea pig)
Description:
P41144
Residue:
380
  
Inhibitor
Name:
BDBM50391595
Synonyms:
CHEMBL2147908
Type:
Small organic molecule
Emp. Form.:
C25H26N2O2
Mol. Mass.:
386.4861
SMILES:
CN1CC[C@]23Cc4nc5cccc(C)c5cc4C[C@@]2(O)[C@H]1Cc1ccc(O)cc31
: