Target
Non-receptor tyrosine-protein kinase TYK2
Ligand
BDBM50391993
Substrate
Meas. Tech.
ChEMBL_851249 (CHEMBL2155761)
Ki
4.2±n/a nM
Citation
 Kulagowski, JJBlair, WBull, RJChang, CDeshmukh, GDyke, HJEigenbrot, CGhilardi, NGibbons, PHarrison, TKHewitt, PRLiimatta, MHurley, CAJohnson, AJohnson, TKenny, JRBir Kohli, PMaxey, RJMendonca, RMortara, KMurray, JNarukulla, RShia, SSteffek, MUbhayakar, SUltsch, Mvan Abbema, AWard, SIWaszkowycz, BZak, M Identification of imidazo-pyrrolopyridines as novel and potent JAK1 inhibitors. J Med Chem 55:5901-21 (2012)  
Target
Name:
Non-receptor tyrosine-protein kinase TYK2
Synonyms:
Non-receptor tyrosine-protein kinase TYK2 (TYK2) TYK2_HUMAN | Tyrosine-protein kinase TYK2
Type:
Protein
Mol. Mass.:
133666.03
Organism:
Homo sapiens (Human)
Description:
P29597
Residue:
1187
  
Inhibitor
Name:
BDBM50391993
Synonyms:
CHEMBL2152297
Type:
Small organic molecule
Emp. Form.:
C17H18N6O
Mol. Mass.:
322.3644
SMILES:
C[C@@H]1CCN(C[C@@H]1n1cnc2cnc3[nH]ccc3c12)C(=O)CC#N
: