Target
Non-receptor tyrosine-protein kinase TYK2
Ligand
BDBM50391997
Substrate
Meas. Tech.
ChEMBL_851249 (CHEMBL2155761)
Ki
250±n/a nM
Citation
 Kulagowski, JJBlair, WBull, RJChang, CDeshmukh, GDyke, HJEigenbrot, CGhilardi, NGibbons, PHarrison, TKHewitt, PRLiimatta, MHurley, CAJohnson, AJohnson, TKenny, JRBir Kohli, PMaxey, RJMendonca, RMortara, KMurray, JNarukulla, RShia, SSteffek, MUbhayakar, SUltsch, Mvan Abbema, AWard, SIWaszkowycz, BZak, M Identification of imidazo-pyrrolopyridines as novel and potent JAK1 inhibitors. J Med Chem 55:5901-21 (2012)  
Target
Name:
Non-receptor tyrosine-protein kinase TYK2
Synonyms:
Non-receptor tyrosine-protein kinase TYK2 (TYK2) TYK2_HUMAN | Tyrosine-protein kinase TYK2
Type:
Protein
Mol. Mass.:
133666.03
Organism:
Homo sapiens (Human)
Description:
P29597
Residue:
1187
  
Inhibitor
Name:
BDBM50391997
Synonyms:
CHEMBL2152301
Type:
Small organic molecule
Emp. Form.:
C20H21N5
Mol. Mass.:
331.4142
SMILES:
C(N1CCC[C@H](C1)n1cnc2cnc3[nH]ccc3c12)c1ccccc1
: