Target
Asparagine synthetase [glutamine-hydrolyzing]
Ligand
BDBM50392270
Substrate
Meas. Tech.
ChEMBL_851327 (CHEMBL2156034)
Ki
33±n/a nM
Citation
 Ikeuchi, HAhn, YMOtokawa, TWatanabe, BHegazy, LHiratake, JRichards, NG A sulfoximine-based inhibitor of human asparagine synthetase kills L-asparaginase-resistant leukemia cells. Bioorg Med Chem 20:5915-27 (2012)  
Target
Name:
Asparagine synthetase [glutamine-hydrolyzing]
Synonyms:
ASNS Asparagine synthetase | TS11
Type:
PROTEIN
Mol. Mass.:
64373.20
Organism:
Homo sapiens (Human)
Description:
ChEMBL_851327
Residue:
561
  
Inhibitor
Name:
BDBM50392270
Synonyms:
CHEMBL2153507
Type:
Small organic molecule
Emp. Form.:
C13H22N7O7PS
Mol. Mass.:
451.395
SMILES:
CS(=O)(NP([O-])(=O)OC[C@H]1O[C@H]([C@H](O)[C@@H]1O)n1cnc2c(N)ncnc12)=CC[NH3+]
: