Target
Integrin alpha-V/beta-5
Ligand
BDBM50392277
Substrate
Meas. Tech.
ChEMBL_851468 (CHEMBL2156474)
IC50
0.76±n/a nM
Citation
 Alloatti, DGiannini, GVesci, LCastorina, MPisano, CBadaloni, ECabri, W Camptothecins in tumor homing via an RGD sequence mimetic. Bioorg Med Chem Lett 22:6509-12 (2012)  
Target
Name:
Integrin alpha-V/beta-5
Synonyms:
ITGAV/ITGB5 | Integrin beta-5/Vitronectin receptor alpha
Type:
Enzyme
Mol. Mass.:
Description:
Components:
This complex has 2 components.
Component 1
Name:
Integrin alpha-V
Synonyms:
ITAV_HUMAN Integrin alpha-V/alpha-5 VNRA Vitronectin receptor | Vitronectin receptor subunit alpha
Type:
PROTEIN
Mol. Mass.:
116024.92
Organism:
Homo sapiens (Human)
Description:
ChEMBL_582336
Residue:
1048
  
Component 2
Name:
Integrin beta-5
Synonyms:
ITB5_HUMAN | ITGB5
Type:
PROTEIN
Mol. Mass.:
88047.37
Organism:
Homo sapiens (Human)
Description:
EBI_10915
Residue:
799
  
Inhibitor
Name:
BDBM50392277
Synonyms:
CHEMBL2153645
Type:
Small organic molecule
Emp. Form.:
C58H65N11O13
Mol. Mass.:
1124.2026
SMILES:
[#6]-[#6][C@@]1([#8])[#6](=O)-[#8]-[#6]-c2c1cc1-c3nc4ccc(-[#8]-[#6](=O)-[#7]-5-[#6]-[#6]-[#7](-[#6]-[#6]-5)-[#6](=O)-c5ccc(-[#6]-[#8]-[#6](=O)-[#7]-[#6@@H](-[#6]-[#6]-[#6](=O)-[#7]-6-[#6]-[#6]-[#7](-[#6]-[#6]-6)-c6cccc(c6)\[#7]=[#6]-6/[#7]-[#6]-[#6]-[#6]-[#7]-6)-[#6](-[#8])=O)cc5)cc4c(\[#6]=[#7]\[#8]C([#6])([#6])[#6])c3-[#6]-n1c2=O
: