Target
Metabotropic glutamate receptor 5
Ligand
BDBM50392356
Substrate
Meas. Tech.
ChEMBL_851667 (CHEMBL2157266)
EC50
970±n/a nM
Citation
 Packiarajan, MFerreira, CGHong, SPWhite, ADChandrasena, GPu, XBrodbeck, RMRobichaud, AJ Azetidinyl oxadiazoles as potent mGluR5 positive allosteric modulators. Bioorg Med Chem Lett 22:6469-74 (2012)  
Target
Name:
Metabotropic glutamate receptor 5
Synonyms:
GPRC1E GRM5_HUMAN metabotropic glutamate 5 | metabotropic glutamate 5a
Type:
Enzyme
Mol. Mass.:
132484.72
Organism:
Homo sapiens (Human)
Description:
Residue:
1212
  
Inhibitor
Name:
BDBM50392356
Synonyms:
CHEMBL2151485
Type:
Small organic molecule
Emp. Form.:
C20H25N3O2
Mol. Mass.:
339.4314
SMILES:
CC1CCC(CC1)C(=O)N1CC(C1)c1nc(no1)-c1cccc(C)c1
: