Target
KiSS-1 receptor
Ligand
BDBM50392408
Substrate
Meas. Tech.
ChEMBL_851680 (CHEMBL2155897)
EC50
0.13±n/a nM
Citation
 Asami, TNishizawa, NIshibashi, YNishibori, KNakayama, MHorikoshi, YMatsumoto, SYamaguchi, MMatsumoto, HTarui, NOhtaki, TKitada, C Serum stability of selected decapeptide agonists of KISS1R using pseudopeptides. Bioorg Med Chem Lett 22:6391-6 (2012)  
Target
Name:
KiSS-1 receptor
Synonyms:
AXOR12 G-protein coupled receptor 54 (GPR54) Hypogonadotropin-1 KISSR_HUMAN Kisspeptins receptor hOT7T175
Type:
G Protein-Coupled Receptor (GPCR)
Mol. Mass.:
42613.79
Organism:
Homo sapiens (Human)
Description:
Binding assay was performed using membranes from the CHO cell transfectants.
Residue:
398
  
Inhibitor
Name:
BDBM50392408
Synonyms:
CHEMBL2151649
Type:
Small organic molecule
Emp. Form.:
C58H85N17O14
Mol. Mass.:
1244.401
SMILES:
CC[C@H](C)[C@H](NC(=O)[C@H](CC(N)=O)NC(=O)[C@H](N)Cc1ccc(O)cc1)C(=O)N[C@@H](CC(N)=O)C(=O)N[C@@H](CO)C(=O)N[C@@H](Cc1ccccc1)C(=O)NNC(=O)N[C@@H](CC(C)C)C(=O)N[C@@H](CCCN=C(N)NC)C(=O)N[C@@H](Cc1ccccc1)C(N)=O
: