Target
Phosphatidylinositol 4,5-bisphosphate 3-kinase catalytic subunit beta isoform
Ligand
BDBM50392462
Substrate
Meas. Tech.
ChEMBL_851912 (CHEMBL2156789)
IC50
244±n/a nM
Citation
 Certal, VHalley, FVirone-Oddos, AThompson, FFiloche-Rommé, BEl-Ahmad, YCarry, JCDelorme, CKarlsson, AAbecassis, PYVincent, LBonnevaux, HNicolas, JPMorales, RMichot, NVade, ILouboutin, APerron, SDoerflinger, GTric, BMonget, SLengauer, CSchio, L Preparation and optimization of new 4-(morpholin-4-yl)-(6-oxo-1,6-dihydropyrimidin-2-yl)amide derivatives as PI3Kß inhibitors. Bioorg Med Chem Lett 22:6381-4 (2012)  
Target
Name:
Phosphatidylinositol 4,5-bisphosphate 3-kinase catalytic subunit beta isoform
Synonyms:
PI3-kinase p110 subunit beta PI3Kbeta PIK3CB Phosphatidylinositol 4,5-bisphosphate 3-kinase catalytic subunit beta (PI3Kbeta) Phosphatidylinositol 4,5-bisphosphate 3-kinase catalytic subunit beta isoform (PI3K) Phosphatidylinositol 4,5-bisphosphate 3-kinase catalytic subunit beta isoform (PI3Kbeta) Phosphatidylinositol-4,5-bisphosphate 3-kinase catalytic subunit beta isoform Phosphoinositide 3-Kinase (PI3K), beta Chain A PtdIns-3-kinase p110
Type:
Enzyme Subunit
Mol. Mass.:
122769.00
Organism:
Homo sapiens (Human)
Description:
P42338
Residue:
1070
  
Inhibitor
Name:
BDBM50392462
Synonyms:
CHEMBL2151931
Type:
Small organic molecule
Emp. Form.:
C17H19FN4O3
Mol. Mass.:
346.3562
SMILES:
Cn1c(CC(=O)Nc2ccc(F)cc2)nc(cc1=O)N1CCOCC1
: