Target
Phosphatidylinositol 4,5-bisphosphate 3-kinase catalytic subunit delta isoform
Ligand
BDBM50392464
Substrate
Meas. Tech.
ChEMBL_851913 (CHEMBL2156790)
IC50
2215±n/a nM
Citation
 Certal, VHalley, FVirone-Oddos, AThompson, FFiloche-Rommé, BEl-Ahmad, YCarry, JCDelorme, CKarlsson, AAbecassis, PYVincent, LBonnevaux, HNicolas, JPMorales, RMichot, NVade, ILouboutin, APerron, SDoerflinger, GTric, BMonget, SLengauer, CSchio, L Preparation and optimization of new 4-(morpholin-4-yl)-(6-oxo-1,6-dihydropyrimidin-2-yl)amide derivatives as PI3Kß inhibitors. Bioorg Med Chem Lett 22:6381-4 (2012)  
Target
Name:
Phosphatidylinositol 4,5-bisphosphate 3-kinase catalytic subunit delta isoform
Synonyms:
PI3-kinase p110 subunit delta PI3-kinase subunit p110-delta PIK3CD Phosphatidylinositol 4,5-biphosphate 3-kinase catalytic subunit delta (PIK3CD) Phosphatidylinositol 4,5-bisphosphate 3-kinase 110 kDa catalytic subunit delta (PI3K delta) Phosphatidylinositol 4,5-bisphosphate 3-kinase catalytic subunit delta (PI3Kdelta) Phosphatidylinositol 4,5-bisphosphate 3-kinase catalytic subunit delta isoform (PI3K delta) Phosphatidylinositol 4,5-bisphosphate 3-kinase catalytic subunit delta isoform (PI3K-delta) Phosphatidylinositol 4,5-bisphosphate 3-kinase catalytic subunit delta isoform (PI3Kdelta)
Type:
Enzyme Subunit
Mol. Mass.:
119489.41
Organism:
Homo sapiens (Human)
Description:
O00329
Residue:
1044
  
Inhibitor
Name:
BDBM50392464
Synonyms:
CHEMBL2151933
Type:
Small organic molecule
Emp. Form.:
C17H18BrFN4O3
Mol. Mass.:
425.252
SMILES:
Cn1c(CC(=O)Nc2ccc(F)c(Br)c2)nc(cc1=O)N1CCOCC1
: