Target
Cannabinoid receptor 1
Ligand
BDBM50392703
Substrate
Meas. Tech.
ChEMBL_854280 (CHEMBL2154446)
Ki
>3000±n/a nM
Citation
 Gembus, VFurman, CMillet, RMansouri, RChavatte, PLevacher, VBrière, JF Scaffold hopping strategy toward original pyrazolines as selective CB2 receptor ligands. Eur J Med Chem 58:396-404 (2012)  
Target
Name:
Cannabinoid receptor 1
Synonyms:
CANN6 CB-R CNR CNR1_HUMAN Cannabinoid receptor Cannabinoid receptor 1 (brain)
Type:
G Protein-Coupled Receptor (GPCR)
Mol. Mass.:
52868.96
Organism:
Homo sapiens (Human)
Description:
P21554
Residue:
472
  
Inhibitor
Name:
BDBM50392703
Synonyms:
CHEMBL2151372
Type:
Small organic molecule
Emp. Form.:
C23H26ClN3O
Mol. Mass.:
395.925
SMILES:
Clc1ccc(cc1)C1=NN(CC1Cc1ccccc1)C(=O)NC1CCCCC1
: