Target
Cannabinoid receptor 1
Ligand
BDBM50392706
Substrate
Meas. Tech.
ChEMBL_854280 (CHEMBL2154446)
Ki
>3000±n/a nM
Citation
 Gembus, VFurman, CMillet, RMansouri, RChavatte, PLevacher, VBrière, JF Scaffold hopping strategy toward original pyrazolines as selective CB2 receptor ligands. Eur J Med Chem 58:396-404 (2012)  
Target
Name:
Cannabinoid receptor 1
Synonyms:
CANN6 CB-R CNR CNR1_HUMAN Cannabinoid receptor Cannabinoid receptor 1 (brain)
Type:
G Protein-Coupled Receptor (GPCR)
Mol. Mass.:
52868.96
Organism:
Homo sapiens (Human)
Description:
P21554
Residue:
472
  
Inhibitor
Name:
BDBM50392706
Synonyms:
CHEMBL2151375
Type:
Small organic molecule
Emp. Form.:
C24H22ClN3O
Mol. Mass.:
403.904
SMILES:
Cc1cc(ccc1Cl)C1=NN(CC1Cc1ccccc1)C(=O)Nc1ccccc1
: