Target
Cannabinoid receptor 2
Ligand
BDBM50392712
Substrate
Meas. Tech.
ChEMBL_854281 (CHEMBL2154447)
Ki
3639±n/a nM
Citation
 Gembus, VFurman, CMillet, RMansouri, RChavatte, PLevacher, VBrière, JF Scaffold hopping strategy toward original pyrazolines as selective CB2 receptor ligands. Eur J Med Chem 58:396-404 (2012)  
Target
Name:
Cannabinoid receptor 2
Synonyms:
CANNABINOID CB2 CB2 CB2B CNR2_HUMAN Cannabinoid CB2 receptor Cannabinoid receptor 2 (CB2R) | hCB2
Type:
G Protein-Coupled Receptor (GPCR)
Mol. Mass.:
39690.94
Organism:
Homo sapiens (Human)
Description:
P34972
Residue:
360
  
Inhibitor
Name:
BDBM50392712
Synonyms:
CHEMBL2151381
Type:
Small organic molecule
Emp. Form.:
C22H30ClN3O
Mol. Mass.:
387.946
SMILES:
Cc1cc(ccc1Cl)C1=NN(CC1C1CCCC1)C(=O)NC1CCCCC1
: