Target
Beta-secretase 1
Ligand
BDBM50392785
Substrate
Meas. Tech.
ChEMBL_853104 (CHEMBL2154572)
IC50
2.1±n/a nM
Citation
 Kaller, MRHarried, SSAlbrecht, BAmarante, PBabu-Khan, SBartberger, MDBrown, JBrown, RChen, KCheng, YCitron, MCroghan, MDGraceffa, RHickman, DJudd, TKriemen, CLa, DLi, VLopez, PLuo, YMasse, CMonenschein, HNguyen, TPennington, LDMiguel, TSSickmier, EAWahl, RCWeiss, MMWen, PHWilliamson, TWood, SXue, MYang, BZhang, JPatel, VZhong, WHitchcock, S A Potent and Orally Efficacious, Hydroxyethylamine-Based Inhibitor of ß-Secretase. ACS Med Chem Lett 3:886-891 (2012)  
Target
Name:
Beta-secretase 1
Synonyms:
ASP2 Aspartyl protease 2 BACE1 Beta-secretase (BACE) Beta-secretase 1 (BACE 1) Beta-secretase 1 (BACE1) Beta-site amyloid precursor protein cleaving enzyme 1 Memapsin-2 beta-Secretase (BACE-1) | beta-Secretase (BACE1)
Type:
Protein
Mol. Mass.:
55755.10
Organism:
Homo sapiens (Human)
Description:
P56817
Residue:
501
  
Inhibitor
Name:
BDBM50392785
Synonyms:
CHEMBL2151240
Type:
Small organic molecule
Emp. Form.:
C29H37F4N3O4
Mol. Mass.:
567.6154
SMILES:
CC(=O)N[C@@H](Cc1ccc(F)c(OC(F)(F)F)c1)[C@H](O)CN[C@H]1CC2(CCC2)Oc2ncc(CC(C)(C)C)cc12
: