Target
Prostaglandin G/H synthase 2
Ligand
BDBM50181914
Substrate
Meas. Tech.
ChEMBL_853436 (CHEMBL2155294)
IC50
5200±n/a nM
Citation
 Windsor, MAHermanson, DJKingsley, PJXu, SCrews, BCHo, WKeenan, CMBanerjee, SSharkey, KAMarnett, LJ Substrate-Selective Inhibition of Cyclooxygenase-2: Development and Evaluation of Achiral Profen Probes. ACS Med Chem Lett 3:759-763 (2012)  
Target
Name:
Prostaglandin G/H synthase 2
Synonyms:
Cox-2 Cyclooxygenase-2 Glucocorticoid-regulated inflammatory cyclooxygenase Macrophage activation-associated marker protein P71/73 PGH synthase 2 PGHS-2 Pghs-b Prostaglandin H2 synthase 2 Ptgs2 Tis10
Type:
Protein
Mol. Mass.:
69020.39
Organism:
Mus musculus (Mouse)
Description:
Q05769
Residue:
604
  
Inhibitor
Name:
BDBM50181914
Synonyms:
2-(2-Fluoro-biphenyl-4-yl)-2-methyl-propionic acid | CHEMBL380853
Type:
Small organic molecule
Emp. Form.:
C16H15FO2
Mol. Mass.:
258.2875
SMILES:
CC(C)(C(O)=O)c1ccc(c(F)c1)-c1ccccc1
: