Target
Leucine-rich repeat serine/threonine-protein kinase 2
Ligand
BDBM105075
Substrate
Meas. Tech.
ChEMBL_853591 (CHEMBL2154046)
Ki
2.4±n/a nM
Citation
 Abdel-Magid, AF Inhibitors of LRRK2 as Treatment for Parkinson's Disease: Patent Highlight. ACS Med Chem Lett 3:701-702 (2012)  
Target
Name:
Leucine-rich repeat serine/threonine-protein kinase 2
Synonyms:
Dardarin LRRK2_HUMAN Leucine-rich repeat serine/threonine-protein kinase 2 PARK8
Type:
Protein
Mol. Mass.:
286113.20
Organism:
Homo sapiens (Human)
Description:
Q5S007
Residue:
2527
  
Inhibitor
Name:
BDBM105075
Synonyms:
CHEMBL2152708 | US8569281, 59
Type:
Small organic molecule
Emp. Form.:
C20H25N5O3
Mol. Mass.:
383.4442
SMILES:
CC(C)Oc1nccc2[nH]nc(-c3cc(C(=O)NC4COC4)n(c3)C(C)C)c12
: