Target
Bromodomain-containing protein 4
Ligand
BDBM50365262
Substrate
Meas. Tech.
ChEMBL_853604 (CHEMBL2154059)
IC50
77±n/a nM
Citation
 Conway, SJ Bromodomains: are readers right for epigenetic therapy? ACS Med Chem Lett 3:691-694 (2012)  
Target
Name:
Bromodomain-containing protein 4
Synonyms:
BRD4 Bromodomain-containing protein 4 (BRD4) Protein HUNK1
Type:
Protein
Mol. Mass.:
152264.84
Organism:
Homo sapiens (Human)
Description:
O60885
Residue:
1362
  
Inhibitor
Name:
BDBM50365262
Synonyms:
(+)-JQ1 CHEMBL1957266 US10124009, Compound (S)-JQ1 US10308662, Compound JQ-1 US10617680, Example JQ-1 US10925881, Name (S)-JQ1 US11078188, Example (+)-JQ1 US11427593, Compound JQ1 US9320741, (S)-JQ1 | US9695172, JQ1
Type:
Small organic molecule
Emp. Form.:
C23H25ClN4O2S
Mol. Mass.:
456.988
SMILES:
Cc1nnc2[C@H](CC(=O)OC(C)(C)C)N=C(c3c(C)c(C)sc3-n12)c1ccc(Cl)cc1
: