Target
Beta-secretase 1
Ligand
BDBM50393089
Substrate
Meas. Tech.
ChEMBL_853647 (CHEMBL2154184)
IC50
2±n/a nM
Citation
 Abdel-Magid, AF BACE Inhibitors: Potential Treatment of Alzheimer's Disease, Dementia, and Related Neurodegenerative Disorders (B): 3-Amino-4-fluoro-1H-isoindol Derivatives: Patent Highlight. ACS Med Chem Lett 3:869-870 (2012)  
Target
Name:
Beta-secretase 1
Synonyms:
ASP2 Aspartyl protease 2 BACE1 Beta-secretase (BACE) Beta-secretase 1 (BACE 1) Beta-secretase 1 (BACE1) Beta-site amyloid precursor protein cleaving enzyme 1 Memapsin-2 beta-Secretase (BACE-1) | beta-Secretase (BACE1)
Type:
Protein
Mol. Mass.:
55755.10
Organism:
Homo sapiens (Human)
Description:
P56817
Residue:
501
  
Inhibitor
Name:
BDBM50393089
Synonyms:
CHEMBL2152904
Type:
Small organic molecule
Emp. Form.:
C28H22FN5O
Mol. Mass.:
463.5056
SMILES:
CCn1cc(cc(C)c1=O)[C@@]1(N=C(N)c2c1cccc2F)c1cccc(c1)-c1cncc(c1)C#N
: