Target
Matrix metalloproteinase-14
Ligand
BDBM50393111
Substrate
Meas. Tech.
ChEMBL_853831 (CHEMBL2154857)
IC50
2630±n/a nM
Citation
 Shengule, SRLoa-Kum-Cheung, WLParish, CRBlairvacq, MMeijer, LNakao, YKaruso, P A one-pot synthesis and biological activity of ageladine A and analogues. J Med Chem 54:2492-503 (2011)  
Target
Name:
Matrix metalloproteinase-14
Synonyms:
MMP-14 MMP14 MT-MMP 1 MT1MMP Matrix Metalloproteinase-14 (MMP-14) Matrix metalloproteinase-14 Membrane-type matrix metalloproteinase 1 | Membrane-type-1 matrix metalloproteinase
Type:
Protein
Mol. Mass.:
65900.19
Organism:
Homo sapiens (Human)
Description:
P50281
Residue:
582
  
Inhibitor
Name:
BDBM50393111
Synonyms:
CHEMBL2153261
Type:
Small organic molecule
Emp. Form.:
C10H8N4S
Mol. Mass.:
216.262
SMILES:
Nc1nc2c(nccc2[nH]1)-c1cccs1
: