Target
Interleukin-1 receptor-associated kinase 3
Ligand
BDBM50393108
Substrate
Meas. Tech.
ChEMBL_853864 (CHEMBL2154984)
Kd
8900±n/a nM
Citation
 Shengule, SRLoa-Kum-Cheung, WLParish, CRBlairvacq, MMeijer, LNakao, YKaruso, P A one-pot synthesis and biological activity of ageladine A and analogues. J Med Chem 54:2492-503 (2011)  
Target
Name:
Interleukin-1 receptor-associated kinase 3
Synonyms:
IL-1 receptor-associated kinase M IRAK-M IRAK3_HUMAN
Type:
PROTEIN
Mol. Mass.:
67767.98
Organism:
Homo sapiens (Human)
Description:
EBI_101055
Residue:
596
  
Inhibitor
Name:
BDBM50393108
Synonyms:
CHEMBL2153266
Type:
Small organic molecule
Emp. Form.:
C15H11N5
Mol. Mass.:
261.2813
SMILES:
Nc1nc2c(nccc2[nH]1)-c1cnc2ccccc2c1
: