Target
ATPase family AAA domain-containing protein 2
Ligand
BDBM50365264
Substrate
Meas. Tech.
ChEMBL_852815 (CHEMBL2156122)
Kd
>50000±n/a nM
Citation
 Chung, CWCoste, HWhite, JHMirguet, OWilde, JGosmini, RLDelves, CMagny, SMWoodward, RHughes, SABoursier, EVFlynn, HBouillot, AMBamborough, PBrusq, JMGellibert, FJJones, EJRiou, AMHomes, PMartin, SLUings, IJToum, JClement, CABoullay, ABGrimley, RLBlandel, FMPrinjha, RKLee, KKirilovsky, JNicodeme, E Discovery and characterization of small molecule inhibitors of the BET family bromodomains. J Med Chem 54:3827-38 (2011)  
Target
Name:
ATPase family AAA domain-containing protein 2
Synonyms:
AAA nuclear coregulator cancer-associated protein ATAD2 PRO2000
Type:
PROTEIN
Mol. Mass.:
158546.30
Organism:
Homo sapiens (Human)
Description:
ChEMBL_1500426
Residue:
1390
  
Inhibitor
Name:
BDBM50365264
Synonyms:
CHEMBL1738926
Type:
Small organic molecule
Emp. Form.:
C25H21N5O2
Mol. Mass.:
423.4665
SMILES:
Cc1nnc2[C@H](NC(=O)OCc3ccccc3)N=C(c3ccccc3)c3ccccc3-n12
: