Target
2-oxoglutarate receptor 1
Ligand
BDBM50393123
Substrate
Meas. Tech.
ChEMBL_852825 (CHEMBL2155424)
IC50
2000±n/a nM
Citation
 Bhuniya, DUmrani, DDave, BSalunke, DKukreja, GGundu, JNaykodi, MShaikh, NSShitole, PKurhade, SDe, SMajumdar, SReddy, SBTambe, SShejul, YChugh, APalle, VPMookhtiar, KACully, DVacca, JChakravarty, PKNargund, RPWright, SDGraziano, MPSingh, SBRoy, SCai, TQ Discovery of a potent and selective small molecule hGPR91 antagonist. Bioorg Med Chem Lett 21:3596-602 (2011)  
Target
Name:
2-oxoglutarate receptor 1
Synonyms:
Alpha-ketoglutarate receptor 1 G-protein coupled receptor 99 GPR99 OXGR1_HUMAN P2Y purinoceptor 15 P2Y-like nucleotide receptor | P2Y15
Type:
PROTEIN
Mol. Mass.:
38261.32
Organism:
Homo sapiens (Human)
Description:
ChEMBL_852825
Residue:
337
  
Inhibitor
Name:
BDBM50393123
Synonyms:
CHEMBL2153446
Type:
Small organic molecule
Emp. Form.:
C26H24ClN3O
Mol. Mass.:
429.941
SMILES:
C[C@H](NC(=O)CCCc1ccc2cccnc2n1)c1ccc(cc1)-c1cccc(Cl)c1
: