Target
Adenosine receptor A1
Ligand
BDBM50393176
Substrate
Meas. Tech.
ChEMBL_852592 (CHEMBL2156703)
Ki
>25000±n/a nM
Citation
 Drabczynska, AYuzlenko, OKöse, MPaskaleva, MSchiedel, ACKarolak-Wojciechowska, JHandzlik, JKarcz, TKuder, KMüller, CEKiec-Kononowicz, K Synthesis and biological activity of tricyclic cycloalkylimidazo-, pyrimido- and diazepinopurinediones. Eur J Med Chem 46:3590-607 (2011)  
Target
Name:
Adenosine receptor A1
Synonyms:
AA1R_RAT ADENOSINE A1 high Adenosine A1 receptor (A1) Adenosine receptors A1 | Adora1
Type:
Protein
Mol. Mass.:
36704.13
Organism:
Rattus norvegicus (rat)
Description:
Residue:
326
  
Inhibitor
Name:
BDBM50393176
Synonyms:
CHEMBL2153619
Type:
Small organic molecule
Emp. Form.:
C17H25N5O2
Mol. Mass.:
331.4127
SMILES:
CC1CCCCC1N1CCCn2c1nc1n(C)c(=O)n(C)c(=O)c21
: