Target
Adenosine receptor A2b
Ligand
BDBM50393188
Substrate
Meas. Tech.
ChEMBL_853232 (CHEMBL2154933)
Ki
>10000±n/a nM
Citation
 Drabczynska, AYuzlenko, OKöse, MPaskaleva, MSchiedel, ACKarolak-Wojciechowska, JHandzlik, JKarcz, TKuder, KMüller, CEKiec-Kononowicz, K Synthesis and biological activity of tricyclic cycloalkylimidazo-, pyrimido- and diazepinopurinediones. Eur J Med Chem 46:3590-607 (2011)  
Target
Name:
Adenosine receptor A2b
Synonyms:
AA2BR_HUMAN ADORA2B Adenosine receptors A2b | Adenosine receptors; A2a & A2b
Type:
G Protein-Coupled Receptor (GPCR)
Mol. Mass.:
36341.22
Organism:
Homo sapiens (Human)
Description:
Residue:
332
  
Inhibitor
Name:
BDBM50393188
Synonyms:
CHEMBL2153620
Type:
Small organic molecule
Emp. Form.:
C17H25N5O2
Mol. Mass.:
331.4127
SMILES:
CC1CCC(CC1)N1CCCn2c1nc1n(C)c(=O)n(C)c(=O)c21
: