Target
Adenosine receptor A2a
Ligand
BDBM50393171
Substrate
Meas. Tech.
ChEMBL_853230 (CHEMBL2154931)
Ki
3270±n/a nM
Citation
 Drabczynska, AYuzlenko, OKöse, MPaskaleva, MSchiedel, ACKarolak-Wojciechowska, JHandzlik, JKarcz, TKuder, KMüller, CEKiec-Kononowicz, K Synthesis and biological activity of tricyclic cycloalkylimidazo-, pyrimido- and diazepinopurinediones. Eur J Med Chem 46:3590-607 (2011)  
Target
Name:
Adenosine receptor A2a
Synonyms:
A2A adenosine receptor (hA2A) ADENOSINE A2 ADORA2 Adenosine A2A receptor (A2AAR)
Type:
G Protein-Coupled Receptor (GPCR)
Mol. Mass.:
44716.46
Organism:
Homo sapiens (Human)
Description:
P29274
Residue:
412
  
Inhibitor
Name:
BDBM50393171
Synonyms:
CHEMBL2153631
Type:
Small organic molecule
Emp. Form.:
C15H21N5O3
Mol. Mass.:
319.3589
SMILES:
Cn1c2nc3N(CCn3c2c(=O)n(C)c1=O)C1CCC(O)CC1
: