Target
Adenosine receptor A2a
Ligand
BDBM50393182
Substrate
Meas. Tech.
ChEMBL_853230 (CHEMBL2154931)
Ki
1160±n/a nM
Citation
 Drabczynska, AYuzlenko, OKöse, MPaskaleva, MSchiedel, ACKarolak-Wojciechowska, JHandzlik, JKarcz, TKuder, KMüller, CEKiec-Kononowicz, K Synthesis and biological activity of tricyclic cycloalkylimidazo-, pyrimido- and diazepinopurinediones. Eur J Med Chem 46:3590-607 (2011)  
Target
Name:
Adenosine receptor A2a
Synonyms:
A2A adenosine receptor (hA2A) ADENOSINE A2 ADORA2 Adenosine A2A receptor (A2AAR)
Type:
G Protein-Coupled Receptor (GPCR)
Mol. Mass.:
44716.46
Organism:
Homo sapiens (Human)
Description:
P29274
Residue:
412
  
Inhibitor
Name:
BDBM50393182
Synonyms:
CHEMBL2153613
Type:
Small organic molecule
Emp. Form.:
C17H25N5O2
Mol. Mass.:
331.4127
SMILES:
Cn1c2nc3N(CCCn3c2c(=O)n(C)c1=O)C1CCCCCC1
: