Target
Adenosine receptor A3
Ligand
BDBM50393172
Substrate
Meas. Tech.
ChEMBL_853050 (CHEMBL2154397)
Ki
>10000±n/a nM
Citation
 Drabczynska, AYuzlenko, OKöse, MPaskaleva, MSchiedel, ACKarolak-Wojciechowska, JHandzlik, JKarcz, TKuder, KMüller, CEKiec-Kononowicz, K Synthesis and biological activity of tricyclic cycloalkylimidazo-, pyrimido- and diazepinopurinediones. Eur J Med Chem 46:3590-607 (2011)  
Target
Name:
Adenosine receptor A3
Synonyms:
A3 adenosine receptor (hA3) ADORA3 | Adenosine A3 receptor (A3AR)
Type:
G Protein-Coupled Receptor (GPCR)
Mol. Mass.:
36197.32
Organism:
Homo sapiens (Human)
Description:
P0DMS8
Residue:
318
  
Inhibitor
Name:
BDBM50393172
Synonyms:
CHEMBL2153627
Type:
Small organic molecule
Emp. Form.:
C14H19N5O2
Mol. Mass.:
289.333
SMILES:
Cn1c2nc3N(CC4CC4)CCCn3c2c(=O)n(C)c1=O
: