Target
Neutrophil collagenase
Ligand
BDBM50393211
Substrate
Meas. Tech.
ChEMBL_850718 (CHEMBL2155987)
Ki
2.5±n/a nM
Citation
 Mucha, AKafarski, PBerlicki, L Remarkable potential of thea-aminophosphonate/phosphinate structural motif in medicinal chemistry. J Med Chem 54:5955-80 (2011)  
Target
Name:
Neutrophil collagenase
Synonyms:
CLG1 MMP8 Matrix metalloproteinase-8 PMNL collagenase | PMNL-CL
Type:
Enzyme
Mol. Mass.:
53413.48
Organism:
Homo sapiens (Human)
Description:
P22894
Residue:
467
  
Inhibitor
Name:
BDBM50393211
Synonyms:
CHEMBL2153737
Type:
Small organic molecule
Emp. Form.:
C38H41N4O6P
Mol. Mass.:
680.7291
SMILES:
NC(=O)[C@H](Cc1c[nH]c2ccccc12)NC(=O)[C@H](CCc1ccccc1)CP(O)(=O)[C@H](Cc1ccccc1)NC(=O)OCc1ccccc1
: