Target
Angiotensin-converting enzyme
Ligand
BDBM50303327
Substrate
Meas. Tech.
ChEMBL_850710 (CHEMBL2155979)
Ki
10000±n/a nM
Citation
 Mucha, AKafarski, PBerlicki, L Remarkable potential of thea-aminophosphonate/phosphinate structural motif in medicinal chemistry. J Med Chem 54:5955-80 (2011)  
Target
Name:
Angiotensin-converting enzyme
Synonyms:
ACE Angiotensin converting enzyme (ACE) Angiotensin-converting enzyme, soluble form CD_antigen=CD143 DCP1 Kininase II
Type:
Enzyme
Mol. Mass.:
149709.01
Organism:
Homo sapiens (Human)
Description:
Residue:
1306
  
Inhibitor
Name:
BDBM50303327
Synonyms:
(2S)-2-((1S,2S)-2-(((R)-1-(benzyloxycarbonylamino)-2-phenylethyl)(hydroxy)phosphoryl)cyclopentanecarboxamido)-3-(1H-indol-3-yl)propanoic acid | CHEMBL571716
Type:
Small organic molecule
Emp. Form.:
C33H36N3O7P
Mol. Mass.:
617.6286
SMILES:
OC(=O)[C@H](Cc1c[nH]c2ccccc12)NC(=O)C1=C(CCC1)P(O)(O)[C@H](Cc1ccccc1)NC(=O)OCc1ccccc1
: