Target
Fatty-acid amide hydrolase 1
Ligand
BDBM26739
Substrate
Meas. Tech.
ChEMBL_851004 (CHEMBL2157384)
IC50
4.6±n/a nM
Citation
 Feledziak, MMuccioli, GGLambert, DMMarchand-Brynaert, J SAR and LC/MS studies ofß-lactamic inhibitors of human fatty acid amide hydrolase (hFAAH): evidence of a nonhydrolytic process. J Med Chem 54:6812-23 (2011)  
Target
Name:
Fatty-acid amide hydrolase 1
Synonyms:
Anandamide amidohydrolase FAAH FAAH1_HUMAN Fatty-acid amide hydrolase (FAAH) Oleamide hydrolase 1
Type:
Protein
Mol. Mass.:
63071.19
Organism:
Homo sapiens (Human)
Description:
O00519
Residue:
579
  
Inhibitor
Name:
BDBM26739
Synonyms:
3-(3-carbamoylphenyl)phenyl N-cyclohexylcarbamate URB 597 URB597 | US9187413, 1a (URB597)
Type:
Small organic molecule
Emp. Form.:
C20H22N2O3
Mol. Mass.:
338.4003
SMILES:
NC(=O)c1cccc(c1)-c1cccc(OC(=O)NC2CCCCC2)c1
: