Target
5-hydroxytryptamine receptor 6
Ligand
BDBM55354
Substrate
Meas. Tech.
ChEMBL_852004 (CHEMBL2157129)
Ki
1956±n/a nM
Citation
 Hajjo, RSetola, VRoth, BLTropsha, A Chemocentric informatics approach to drug discovery: identification and experimental validation of selective estrogen receptor modulators as ligands of 5-hydroxytryptamine-6 receptors and as potential cognition enhancers. J Med Chem 55:5704-19 (2012)  
Target
Name:
5-hydroxytryptamine receptor 6
Synonyms:
5-HT-6 5-hydroxytryptamine receptor 6 (5-HT-6) 5-hydroxytryptamine receptor 6 (5HT6) HTR6 Serotonin 6 (5-HT6) receptor | Serotonin Receptor 6
Type:
G Protein-Coupled Receptor (GPCR)
Mol. Mass.:
46968.43
Organism:
Homo sapiens (Human)
Description:
P50406
Residue:
440
  
Inhibitor
Name:
BDBM55354
Synonyms:
CLOMIPHENE MLS000069760 cid_1548953 | cid_6420009
Type:
Small organic molecule
Emp. Form.:
C26H28ClNO
Mol. Mass.:
405.96
SMILES:
CCN(CC)CCOc1ccc(cc1)C(=C(\Cl)c1ccccc1)\c1ccccc1
: