Target
Presenilin-2
Ligand
BDBM50393455
Substrate
Meas. Tech.
ChEMBL_855576 (CHEMBL2163022)
IC50
16±n/a nM
Citation
 Wu, WLDomalski, MBurnett, DAJosien, HBara, TRajagopalan, MXu, RClader, JGreenlee, WJBrunskill, AHyde, LADel Vecchio, RACohen-Williams, MESong, LLee, JTerracina, GZhang, QNomeir, AParker, EMZhang, L Discovery of SCH 900229, a Potent Presenilin 1 Selective ¿-Secretase Inhibitor for the Treatment of Alzheimer's Disease. ACS Med Chem Lett 3:892-896 (2012)  
Target
Name:
Presenilin-2
Synonyms:
AD3LP AD5 Gamma-secretase PS2 PSN2_HUMAN Presenilin 2 Presenilin-2 CTF subunit STM-2 | STM2
Type:
PROTEIN
Mol. Mass.:
50116.65
Organism:
Homo sapiens (Human)
Description:
ChEMBL_855576
Residue:
448
  
Inhibitor
Name:
BDBM50393455
Synonyms:
CHEMBL2159691
Type:
Small organic molecule
Emp. Form.:
C21H18ClF2NO4S
Mol. Mass.:
453.887
SMILES:
Fc1ccc(F)c2c1OC[C@H]1[C@H](CCC#N)OCC[C@@]21S(=O)(=O)c1ccc(Cl)cc1
: