Target
Low molecular weight phosphotyrosine protein phosphatase
Ligand
BDBM50341993
Substrate
Meas. Tech.
ChEMBL_857174 (CHEMBL2163148)
IC50
220±n/a nM
Citation
 Maccari, ROttanà, R Low molecular weight phosphotyrosine protein phosphatases as emerging targets for the design of novel therapeutic agents. J Med Chem 55:2-22 (2012)  
Target
Name:
Low molecular weight phosphotyrosine protein phosphatase
Synonyms:
3.1.3.2 ACP1 LMW-PTP LMWPTP PPAC_HUMAN low molecular weight phosphotyrosine protein phosphatase isoform c
Type:
Mol. Mass.:
18042.81
Organism:
Homo sapiens (Human)
Description:
P24666
Residue:
158
  
Inhibitor
Name:
BDBM50341993
Synonyms:
4-((3-((3-(4-carboxybenzyl)-4-oxo-2-(phenylimino)thiazolidin-5-ylidene)methyl)phenoxy)methyl)benzoic acid | CHEMBL1765349
Type:
Small organic molecule
Emp. Form.:
C32H24N2O6S
Mol. Mass.:
564.608
SMILES:
OC(=O)c1ccc(COc2cccc(\C=C3/S\C(=N/c4ccccc4)N(Cc4ccc(cc4)C(O)=O)C3=O)c2)cc1
: