Target
ALK tyrosine kinase receptor
Ligand
BDBM50393619
Substrate
Meas. Tech.
ChEMBL_855336 (CHEMBL2161942)
IC50
3±n/a nM
Citation
 Mesaros, EFThieu, TVWells, GJZificsak, CAWagner, JCBreslin, HJTripathy, RDiebold, JLMcHugh, RJWohler, ATQuail, MRWan, WLu, LHuang, ZAlbom, MSAngeles, TSWells-Knecht, KJAimone, LDCheng, MAtor, MAOtt, GRDorsey, BD Strategies to mitigate the bioactivation of 2-anilino-7-aryl-pyrrolo[2,1-f][1,2,4]triazines: identification of orally bioavailable, efficacious ALK inhibitors. J Med Chem 55:115-25 (2012)  
Target
Name:
ALK tyrosine kinase receptor
Synonyms:
ALK ALK_HUMAN CD_antigen: CD246
Type:
Protein
Mol. Mass.:
176453.10
Organism:
Homo sapiens (Human)
Description:
Q9UM73
Residue:
1620
  
Inhibitor
Name:
BDBM50393619
Synonyms:
CHEMBL2158530
Type:
Small organic molecule
Emp. Form.:
C28H32FN5O3
Mol. Mass.:
505.5838
SMILES:
COc1cc(ccc1Nc1ncc2ccc(-c3ccccc3OC)n2n1)C1CCN(CC(O)CF)CC1
: