Target
Insulin receptor
Ligand
BDBM50393611
Substrate
Meas. Tech.
ChEMBL_855343 (CHEMBL2161949)
IC50
410±n/a nM
Citation
 Mesaros, EFThieu, TVWells, GJZificsak, CAWagner, JCBreslin, HJTripathy, RDiebold, JLMcHugh, RJWohler, ATQuail, MRWan, WLu, LHuang, ZAlbom, MSAngeles, TSWells-Knecht, KJAimone, LDCheng, MAtor, MAOtt, GRDorsey, BD Strategies to mitigate the bioactivation of 2-anilino-7-aryl-pyrrolo[2,1-f][1,2,4]triazines: identification of orally bioavailable, efficacious ALK inhibitors. J Med Chem 55:115-25 (2012)  
Target
Name:
Insulin receptor
Synonyms:
INSR INSR_HUMAN Insulin receptor beta subunit
Type:
Receptor Tyrosine Kinase
Mol. Mass.:
156322.60
Organism:
Homo sapiens (Human)
Description:
P06213
Residue:
1382
  
Inhibitor
Name:
BDBM50393611
Synonyms:
CHEMBL2158515
Type:
Small organic molecule
Emp. Form.:
C26H29N7O3
Mol. Mass.:
487.5536
SMILES:
COc1cc(ccc1Nc1ncc2ccc(-c3ccncc3OC)n2n1)C1CCN(CC(N)=O)CC1
: