Target
Monoglyceride lipase
Ligand
BDBM50393684
Substrate
Meas. Tech.
ChEMBL_856311 (CHEMBL2160518)
IC50
354.81±n/a nM
Citation
 Kapanda, CNMasquelier, JLabar, GMuccioli, GGPoupaert, JHLambert, DM Synthesis and pharmacological evaluation of 2,4-dinitroaryldithiocarbamate derivatives as novel monoacylglycerol lipase inhibitors. J Med Chem 55:5774-83 (2012)  
Target
Name:
Monoglyceride lipase
Synonyms:
HU-K5 Lysophospholipase-like MGL MGLL_HUMAN
Type:
Hydrolase
Mol. Mass.:
33264.56
Organism:
Homo sapiens (Human)
Description:
Human recombinant MGL (Cayman Chemical, cat# 10008354).
Residue:
303
  
Inhibitor
Name:
BDBM50393684
Synonyms:
CHEMBL2158918
Type:
Small organic molecule
Emp. Form.:
C24H22N4O4S2
Mol. Mass.:
494.586
SMILES:
[O-][N+](=O)c1ccc(SC(=S)N2CCN(CC2)C(c2ccccc2)c2ccccc2)c(c1)[N+]([O-])=O
: