Target
Delta-type opioid receptor
Ligand
BDBM50182942
Substrate
Meas. Tech.
ChEMBL_856830 (CHEMBL2163095)
Ki
0.100000±n/a nM
Citation
 Breslin, HJDiamond, CJKavash, RWCai, CDyatkin, ABMiskowski, TAZhang, SPWade, PRHornby, PJHe, W Identification of a duald OR antagonist/µ OR agonist as a potential therapeutic for diarrhea-predominant Irritable Bowel Syndrome (IBS-d). Bioorg Med Chem Lett 22:4869-72 (2012)  
Target
Name:
Delta-type opioid receptor
Synonyms:
Cytochrome P450 3A4 Delta opioid receptor Delta-type opioid receptor (DOR) OPRD_RAT Opioid receptor Opioid receptors; mu & delta Ror-a | Voltage-gated potassium channel
Type:
G Protein-Coupled Receptor (GPCR)
Mol. Mass.:
40465.04
Organism:
Rattus norvegicus (rat)
Description:
Competition binding assays were using CHO-K1 cell membranes expressing the opioid receptor.
Residue:
372
  
Inhibitor
Name:
BDBM50182942
Synonyms:
(S)-2-amino-3-(4-hydroxy-2,6-dimethylphenyl)-1-((S)-3-(4-phenyl-1H-imidazol-2-yl)-3,4-dihydroisoquinolin-2(1H)-yl)propan-1-one | CHEMBL208454
Type:
Small organic molecule
Emp. Form.:
C29H30N4O2
Mol. Mass.:
466.5741
SMILES:
Cc1cc(O)cc(C)c1C[C@H](N)C(=O)N1Cc2ccccc2C[C@H]1c1nc(c[nH]1)-c1ccccc1
: