Target
Cruzipain
Ligand
BDBM50393872
Substrate
Meas. Tech.
ChEMBL_855698 (CHEMBL2160678)
IC50
200±n/a nM
Citation
 dos Santos Filho, JMMoreira, DRde Simone, CAFerreira, RSMcKerrow, JHMeira, CSGuimarães, ETSoares, MB Optimization of anti-Trypanosoma cruzi oxadiazoles leads to identification of compounds with efficacy in infected mice. Bioorg Med Chem 20:6423-33 (2012)  
Target
Name:
Cruzipain
Synonyms:
CYSP_TRYCR Cruzaine | Major cysteine proteinase
Type:
Protein
Mol. Mass.:
49831.41
Organism:
Trypanosoma cruzi
Description:
P25779
Residue:
467
  
Inhibitor
Name:
BDBM50393872
Synonyms:
CHEMBL2158133
Type:
Small organic molecule
Emp. Form.:
C17H13BrN4O4
Mol. Mass.:
417.214
SMILES:
COc1cc(C=NNC(=O)c2nc(no2)-c2ccc(Br)cc2)ccc1O
: