Target
Beta-secretase 1
Ligand
BDBM50393892
Substrate
Meas. Tech.
ChEMBL_855857 (CHEMBL2161501)
IC50
18±n/a nM
Citation
 Sund, CBelda, OBorkakoti, NLindberg, JDerbyshire, DVrang, LHamelink, EÅhgren, CWoestenenk, EWikström, KEneroth, ALindström, EKalayanov, G Design and synthesis of potent hydroxyethylamine (HEA) BACE-1 inhibitors carrying prime side 4,5,6,7-tetrahydrobenzazole and 4,5,6,7-tetrahydropyridinoazole templates. Bioorg Med Chem Lett 22:6721-7 (2012)  
Target
Name:
Beta-secretase 1
Synonyms:
ASP2 Aspartyl protease 2 BACE1 Beta-secretase (BACE) Beta-secretase 1 (BACE 1) Beta-secretase 1 (BACE1) Beta-site amyloid precursor protein cleaving enzyme 1 Memapsin-2 beta-Secretase (BACE-1) | beta-Secretase (BACE1)
Type:
Protein
Mol. Mass.:
55755.10
Organism:
Homo sapiens (Human)
Description:
P56817
Residue:
501
  
Inhibitor
Name:
BDBM50393892
Synonyms:
CHEMBL2158253
Type:
Small organic molecule
Emp. Form.:
C26H38N2O3S
Mol. Mass.:
458.657
SMILES:
CC(=O)N[C@@H](Cc1ccccc1)[C@H](O)CNC1CC(C)(C)Oc2sc(CC(C)(C)C)cc12
: