Target
D(1A) dopamine receptor
Ligand
BDBM82247
Substrate
Meas. Tech.
ChEMBL_856122 (CHEMBL2162510)
Ki
0.94±n/a nM
Citation
 Clark, AHMcCorvy, JDConley, JMWilliams, WKBekkam, MWatts, VJNichols, DE Identification of a 2-phenyl-substituted octahydrobenzo[f]quinoline as a dopamine D3 receptor-selective full agonist ligand. Bioorg Med Chem 20:6366-74 (2012)  
Target
Name:
D(1A) dopamine receptor
Synonyms:
DA D1 receptor DRD1 Dopamine D1 receptor Dopamine D1A
Type:
Enzyme
Mol. Mass.:
49303.43
Organism:
Homo sapiens (Human)
Description:
P21728
Residue:
446
  
Inhibitor
Name:
BDBM82247
Synonyms:
8-Chloro-3-methyl-5-phenyl-2,3,4,5-tetrahydro-1H-benzo[d]azepin-7-ol(SCH 23390) CHEMBL2158641 SCH 23388 SCH 23390 (R-enantiomer) | SCH 23390,R(+)
Type:
Small organic molecule
Emp. Form.:
C17H18ClNO
Mol. Mass.:
287.784
SMILES:
CN1CCc2cc(Cl)c(O)cc2[C@H](C1)c1ccccc1
: