Target
Acetylcholinesterase
Ligand
BDBM10620
Substrate
Meas. Tech.
ChEMBL_856948 (CHEMBL2160739)
IC50
1110±n/a nM
Citation
 Roy, KKTota, STripathi, TChander, SNath, CSaxena, AK Lead optimization studies towards the discovery of novel carbamates as potent AChE inhibitors for the potential treatment of Alzheimer's disease. Bioorg Med Chem 20:6313-20 (2012)  
Target
Name:
Acetylcholinesterase
Synonyms:
ACES_MOUSE Acetylcholinesterase (mouse AChE) Ache
Type:
Enzyme
Mol. Mass.:
68165.65
Organism:
Mus musculus (mouse)
Description:
Residue:
614
  
Inhibitor
Name:
BDBM10620
Synonyms:
(S)-3-(1-(dimethylamino)ethyl)phenyl ethyl(methyl)carbamate 3-(1-(dimethylamino)ethyl)phenyl ethyl(methyl)carbamate CHEMBL636 Ethyl-methyl-carbamic acid 3-((R)-1-dimethylamino-ethyl)-phenyl ester Ethyl-methyl-carbamic acid 3-(1-dimethylamino-ethyl)-phenyl ester Rivastigmine SDZ-212-713 | SDZ-ENA-713
Type:
Small organic molecule
Emp. Form.:
C14H22N2O2
Mol. Mass.:
250.3367
SMILES:
[H][C@@](C)(N(C)C)c1cccc(OC(=O)N(C)CC)c1
: