Target
Bile acid receptor
Ligand
BDBM50167161
Substrate
Meas. Tech.
ChEMBL_854780 (CHEMBL2161911)
EC50
25±n/a nM
Citation
 Fu, JSi, PZheng, MChen, LShen, XTang, YLi, W Discovery of new non-steroidal FXR ligands via a virtual screening workflow based on Phase shape and induced fit docking. Bioorg Med Chem Lett 22:6848-53 (2012)  
Target
Name:
Bile acid receptor
Synonyms:
BAR FXR HRR1 NR1H4_HUMAN RIP14 Retinoid X receptor-interacting protein 14 | farnesoid x receptor
Type:
Nuclear Receptor
Mol. Mass.:
55916.24
Organism:
Homo sapiens (Human)
Description:
Q96RI1
Residue:
486
  
Inhibitor
Name:
BDBM50167161
Synonyms:
(E)-3-{3-[Cyclohexanecarbonyl-(4'-dimethylamino-biphenyl-4-ylmethyl)-amino]-phenyl}-acrylic acid methyl ester | CHEMBL192966
Type:
Small organic molecule
Emp. Form.:
C32H36N2O3
Mol. Mass.:
496.6398
SMILES:
COC(=O)\C=C\c1cccc(c1)N(Cc1ccc(cc1)-c1ccc(cc1)N(C)C)C(=O)C1CCCCC1
: