Target
ATP-citrate synthase
Ligand
BDBM50394670
Substrate
Meas. Tech.
ChEMBL_857792 (CHEMBL2169035)
Ki
370±n/a nM
Citation
 Abramson, HN The lipogenesis pathway as a cancer target. J Med Chem 54:5615-38 (2011)  
Target
Name:
ATP-citrate synthase
Synonyms:
ACLY | ACLY_HUMAN
Type:
PROTEIN
Mol. Mass.:
120848.43
Organism:
Homo sapiens (Human)
Description:
ChEMBL_455196
Residue:
1101
  
Inhibitor
Name:
BDBM50394670
Synonyms:
CHEMBL2165263
Type:
Small organic molecule
Emp. Form.:
C25H28ClNO6
Mol. Mass.:
473.946
SMILES:
O[C@@H](CCCCCn1c(cc2cc(Cl)ccc12)-c1ccccc1)C[C@@](O)(CC(O)=O)C(O)=O
: