Target
Aurora kinase B
Ligand
BDBM50394786
Substrate
Meas. Tech.
ChEMBL_859400 (CHEMBL2167306)
Kd
2.4±n/a nM
Citation
 Liu, GAbraham, STran, LVickers, TDXu, SHadd, MJQuiambao, SHolladay, MWHua, HFord Pulido, JMGunawardane, RNDavis, MIEichelberger, SRApuy, JLGitnick, DGardner, MFJames, JBreider, MABelli, BArmstrong, RCTreiber, DK Discovery of highly potent and selective pan-Aurora kinase inhibitors with enhanced in vivo antitumor therapeutic index. J Med Chem 55:3250-60 (2012)  
Target
Name:
Aurora kinase B
Synonyms:
AIK2 AIM1 ARK2 AURKB_HUMAN Aurora B-INCENP Aurora kinase B (AURKB) STK-1 STK12 Serine/threonine-protein kinase aurora B
Type:
Protein
Mol. Mass.:
39327.72
Organism:
Homo sapiens (Human)
Description:
Q96GD4
Residue:
344
  
Inhibitor
Name:
BDBM50394786
Synonyms:
CHEMBL2163403
Type:
Small organic molecule
Emp. Form.:
C27H31N9O2S
Mol. Mass.:
545.659
SMILES:
Cc1cc(Nc2nc(Sc3ccc(NC(=O)CN4CC[C@H](C4)C(=O)N4CCCC4)cc3)nn3cccc23)n[nH]1
: